{"text_format":"1","workbook":"xlsx","n_sheets":9,"sheets":["Introduction","Input","Design Load Rating","State Legal Load Rating","SHV Load Rating","Summary","Modulus of Soil Reaction","Calcs","Options"],"not_rendered":{"charts":0,"images":15,"macros":1,"external_links":0,"defined_names":6,"comments":0,"pivot_tables":0},"unopened":[],"bounds":{"document_bytes":16777216,"sheet_cells":100000,"rows_first":2000,"rows_last":500,"rows_between":2000,"halvings":0,"cell_chars":16384,"cell_head_chars":4096},"cells_cut":0,"cells_raw":0,"read":"whole","date_system":"1900"}

{"sheet":"Introduction","index":0,"n_rows":38,"n_cols":10,"rows_kept":38,"cut":false,"hidden":false,"merged":[[0,9,12,18],[21,0,21,8],[23,0,23,8],[9,2,9,3],[9,4,9,5],[15,0,15,8],[17,0,17,8],[13,0,13,8],[10,4,10,5],[11,4,11,5],[0,3,0,5],[5,2,5,3],[7,2,7,3],[5,4,5,5],[6,4,6,5],[7,4,7,5],[33,0,33,8],[36,0,36,8],[37,0,37,8],[19,0,19,8],[25,0,25,8],[27,0,27,8],[29,0,29,8],[2,4,2,5],[3,4,3,5],[6,1,6,3],[31,0,31,1],[32,0,32,8]]}
[null,null,null,"INTRODUCTION",null,null,null,null,null,"DISCLAIMER: The Louisiana Department of Transportation and Development (LaDOTD) makes these documents and software available on an \"as is\" basis. All warranties and representations of any kind with regard to said documents and software are disclaimed, including the implied warranties of merchantability and fitness for a particular use. Under no circumstances will the LaDOTD, or any of its officers or employees be liable for any consequential, incidental, special or exemplary damages even if apprised of the likelihood of such damages occurring. The LaDOTD does not warrant the documents and software against deficiencies of any kind. The use of any of these documents and software for work that is under contract with the LaDOTD does not relieve the contractor from any obligations assumed by the contract, or from complete and proper fulfillment of the terms of the contract, nor does it entitle the contractor to compensation for damages or loss which could be attributed to such use.\n\nInformation on this web site is posted to aid in the efficient dissemination of information to designers. The data contained within this web site is periodically updated. Designers are responsible to be aware of any updates and incorporate significant changes into their final design."]
[]
[null,null,null,"Date:","2020-01-02"]
[null,null,null,"Version:","1.0"]
[]
[null,null,"Developed By:",null,"Qiming Chen"]
[null,"Checked By:",null,null,"Suba Herath",null," "]
[null,null,"Reviewed By:","QA","Yan \"Seraphy\" Shen",null," "]
[]
[null,null,"Maintained By:",null,"Qiming Chen"]
[null,null,null,"Email:","qiming.chen@la.gov"]
[null,null,null,"Phone:","225-379-1412"]
[]
["Genearl: This spreadsheet is designed to aid a qualified engineer in completing the bridge load rating analysis of a smooth steel pipe culvert structure (DOTD culvert structure type: smooth STLPIP, RRTKCR). Sound engineering judgement and familiariry with the analysis are required to choose appropriate input values and to recognize situations that may deviate from the standard case on which these spreadsheets based. This spreadsheet is comprised of nine worksheets: Introduction, Input, Deisng Load Rating, State Legal Load Rating, SHV load rating, Summary, Modulus of Soil Reaction, Options, and Calcs. The Input and Summary worksheets are protected. The passoword is \"Rating\"."]
[]
["Input Worksheet:  Yellow shaded cells are required input, please input a appropriate value or choose a appropriate option from the drop-down list."]
[]
["Design Load Rating: This worksheet will be updated automatically after inputting the appropriate values in the Input worksheet. This worksheet contains rating factors for HL-93 design truck and tandem."]
[]
["State Legal Load Rating:  This worksheet will be updated automatically after inputting the appropriate values in the Input worksheet. This worksheet contains rating factors for state legal loads: LA Type 3, LA Type 3-S2, Type 3-3, LA Type 6, and LA Type 8."]
{"$rows_left_out":19}
{"sheet":"Input","index":1,"n_rows":56,"n_cols":15,"rows_kept":56,"cut":false,"hidden":false,"merged":[[52,0,52,1],[53,0,53,1],[15,0,15,2],[15,5,15,8],[54,0,54,1],[34,0,34,1],[26,0,26,2],[43,0,43,1],[35,0,35,1],[42,0,42,1],[49,0,49,1],[50,0,50,1],[51,0,51,1],[20,0,20,1],[21,0,21,1],[22,0,22,1],[4,10,4,12],[2,4,2,7],[2,8,2,9],[2,10,2,12],[3,4,3,7],[3,8,3,9],[3,10,3,12],[6,4,6,7],[6,8,6,9],[7,1,7,2],[5,10,5,12],[6,10,6,12],[13,9,13,10],[7,4,7,7],[7,8,7,9],[7,10,7,12],[8,1,8,12],[12,4,12,8],[12,9,12,12],[39,0,39,1],[38,0,38,1],[29,0,29,1],[30,0,30,1],[31,0,31,1],[14,5,14,8],[4,4,4,7],[4,8,4,9],[23,0,23,1],[0,0,0,2],[2,1,2,2],[4,1,4,2],[6,1,6,2],[5,1,5,2],[3,1,3,2],[10,0,10,3],[12,0,12,3],[14,0,14,2],[5,4,5,7],[5,8,5,9],[13,5,13,8]]}
["Bridge Data"]
[]
["District    ",2,null,"Structure Number",2264300100701,null,null,null,"Bridge Name ",null,"Drain Canal"]
["Parish   ",26,null,"Recall Number",20459,null,null,null,"Inspection Date",null,"02/12/2018"]
["Route","LA 3139",null,"Year Built",1986,null,null,null,"Overall",null,"7"]
["Bridge Posting","-",null,"Design Load","-",null,null,null,"Deck",null,"N"]
["Bridge Type","STLPIP",null,"Roadway Width",38,null,null,null,"Super",null,"N"]
["Bridge Length",25,null,"Plan Location",null,null,null,null,"Sub",null,"N"]
["Standard Plan"," "]
[]
["Bridge Load Rating Summary"]
[]
["Dead Load",null,null,null,"LRFR Evaluation Factors",null,null,null,null,"Traffic"]
["Surface Thickness (in)",null,null,63,"Condition Factor (φc)*","-",null,null,null,"ADTT (one way)",null,null,200,null,"Yellow shaded areas are required input."]
["Wearing Surface Type",null,null,"-","System Factor (φs)",1,null,null,null,null,null,null,null,null,"Input a value or choose a option from a drop-down list."]
["Non-Structural Attachments",null,null,"-","Surface Rating ","-"]
["*Condition is already considered at element level."]
[]
["Pipe Information"]
["Basic Information"]
{"$rows_left_out":37}
{"sheet":"Design Load Rating","index":2,"n_rows":320,"n_cols":9,"rows_kept":320,"cut":false,"hidden":false,"merged":[[219,0,219,3],[128,0,128,3],[138,0,138,3],[187,0,187,3],[38,0,38,2],[100,0,100,1],[39,0,39,2],[40,0,40,2],[60,1,60,2],[62,1,62,2],[63,1,63,2],[81,1,82,1],[91,1,91,2],[92,1,92,2],[318,0,319,0],[318,5,319,5],[249,0,249,5],[295,0,295,2],[301,0,301,2],[314,0,314,4],[316,0,317,0],[313,0,313,5],[284,0,284,2],[255,0,255,2],[264,0,264,2],[269,0,269,2],[19,1,19,2],[10,1,10,2],[11,1,11,2],[12,1,12,2],[74,1,75,1],[61,1,61,2],[59,1,59,2],[25,0,25,1],[46,1,46,2],[27,0,27,2],[29,0,29,2],[36,0,36,2],[52,0,52,1],[28,0,28,2],[35,0,35,2],[37,0,37,2],[7,0,7,2],[8,0,8,2],[17,1,17,2],[18,1,18,2],[14,0,14,1],[0,0,0,5],[2,0,2,1],[4,0,4,5],[5,0,5,5],[6,0,6,5],[235,1,236,1],[109,1,109,2],[110,1,110,2],[127,0,127,3],[129,0,129,1],[137,0,137,3],[139,0,139,1],[229,1,230,1],[218,0,218,3],[220,0,220,1],[186,0,186,3],[188,0,188,1],[192,0,206,0],[209,0,211,0],[157,0,171,0],[175,0,179,0]]}
["LRFR of Smooth Steel Pipe Structures                                     "]
[]
["A.   Design Dimensions"]
[]
["   1.  For typical structures, use the actual field measured span for calculations."]
["   2.  For those deflected over 5%, use 2 x the top radius (2 Rt) in lieu of span for calculations."]
[]
["Then, Span Length used in Load Rating Calculation =",null,null,{"$f":" IF(Input!$C$31<=5%,Input!$C$22/12,2*Input!$C$30)","v":8},"ft"]
["Then, Rt used in Load Rating Calculation =",null,null,{"$f":"Input!$C$30","v":4},"ft"]
[]
[null,"Inside radius of the steel pipe, ri =",null,{"$f":"Input!$C$22/2","v":48},"in"]
[null,"Outside radius of the steel pipe, ro =",null,{"$f":"(Input!$C$22/2+Input!$C$23)","v":49.064999999999998},"in"]
[null,"Mean radius of the steel pipe, r =",null,{"$f":"(Input!$C$22+Input!$C$23)/2","v":48.532499999999999},"in"]
[]
["B.   Pipe Properties",null,null," "]
[]
["Mechanical Properties:"]
[null,"Fy = Minimum Yield Point of the Steel",null,{"$f":"Input!$C$24","v":33},"ksi"]
[null,"Fu = Minimum Tensile Strength of the Steel",null,45,"ksi"]
[null,"E = Modulus of Elasticity of Steel",null,29000,"ksi"]
{"$rows_left_out":301}
{"sheet":"State Legal Load Rating","index":3,"n_rows":491,"n_cols":9,"rows_kept":491,"cut":false,"hidden":false,"merged":[[29,0,29,2],[35,0,35,2],[36,0,36,2],[17,1,17,2],[0,0,0,5],[2,0,2,1],[4,0,4,5],[5,0,5,5],[6,0,6,5],[7,0,7,2],[8,0,8,2],[10,1,10,2],[11,1,11,2],[12,1,12,2],[14,0,14,1],[181,0,181,3],[37,0,37,2],[38,0,38,2],[39,0,39,2],[63,1,63,2],[74,1,75,1],[81,1,82,1],[100,0,100,1],[46,1,46,2],[52,0,52,1],[59,1,59,2],[60,1,60,2],[61,1,61,2],[62,1,62,2],[91,1,91,2],[92,1,92,2],[40,0,40,2],[18,1,18,2],[19,1,19,2],[25,0,25,1],[27,0,27,2],[28,0,28,2],[486,4,487,4],[113,2,113,3],[114,2,114,3],[115,2,115,3],[114,4,114,5],[115,4,115,5],[483,0,483,5],[471,0,471,5],[484,0,484,3],[404,1,405,1],[410,1,411,1],[450,0,450,5],[422,1,423,1],[428,1,429,1],[456,0,456,5],[229,0,229,3],[116,2,116,3],[117,2,117,3],[118,2,118,3],[119,2,119,3],[116,4,116,5],[117,4,117,5],[118,4,118,5],[119,4,119,5],[112,4,113,5],[103,3,103,4],[104,3,104,4],[105,3,105,4],[106,3,106,4],[107,3,107,4],[108,3,108,4],[112,1,112,3],[346,0,346,3],[140,0,140,3],[142,0,142,1],[150,0,150,3],[152,0,152,1],[200,0,214,0],[160,0,160,3],[162,0,162,1],[170,0,170,3],[172,0,172,1],[180,0,180,3],[182,0,182,1],[141,0,141,3],[151,0,151,3],[161,0,161,3],[171,0,171,3],[352,0,366,0],[387,0,387,3],[389,0,389,1],[369,0,379,0],[416,1,417,1],[348,0,348,1],[331,0,339,0],[218,0,222,0],[273,0,287,0],[308,0,308,3],[310,0,310,1],[314,0,328,0],[252,0,260,0],[290,0,301,0],[231,0,231,1],[235,0,249,0],[267,0,267,3],[269,0,269,1],[230,0,230,3],[268,0,268,3],[309,0,309,3],[347,0,347,3],[388,0,388,3]]}
["LRFR of Smooth Steel Pipe Structures                                     "]
[]
["A.   Design Dimensions"]
[]
["   1.  For typical structures, use the actual field measured span for calculations."]
["   2.  For those deflected over 5%, use 2 x the top radius (2 Rt) in lieu of span for calculations."]
[]
["Then, Span Length used in Load Rating Calculation =",null,null,{"$f":"'Design Load Rating'!D8","v":8},"ft"]
["Then, Rt used in Load Rating Calculation =",null,null,{"$f":"'Design Load Rating'!D9","v":4},"ft"]
[]
[null,"Inside radius of the steel pipe, ri =",null,{"$f":"'Design Load Rating'!D11","v":48},"in"]
[null,"Outside radius of the steel pipe, ro =",null,{"$f":"'Design Load Rating'!D12","v":49.064999999999998},"in"]
[null,"Mean radius of the steel pipe, r =",null,{"$f":"'Design Load Rating'!D13","v":48.532499999999999},"in"]
[]
["B.   Pipe Properties",null,null," "]
[]
["Mechanical Properties:"]
[null,"Fy = Minimum Yield Point of the Steel",null,{"$f":"'Design Load Rating'!D18","v":33},"ksi"]
[null,"Fu = Minimum Tensile Strength of the Steel",null,{"$f":"'Design Load Rating'!D19","v":45},"ksi"]
[null,"E = Modulus of Elasticity of Steel",null,{"$f":"'Design Load Rating'!D20","v":29000},"ksi"]
{"$rows_left_out":472}
{"sheet":"SHV Load Rating","index":4,"n_rows":500,"n_cols":9,"rows_kept":500,"cut":false,"hidden":false,"merged":[[240,0,240,3],[17,1,17,2],[0,0,0,5],[2,0,2,1],[4,0,4,5],[5,0,5,5],[6,0,6,5],[7,0,7,2],[8,0,8,2],[10,1,10,2],[11,1,11,2],[12,1,12,2],[14,0,14,1],[40,0,40,2],[18,1,18,2],[19,1,19,2],[25,0,25,1],[27,0,27,2],[28,0,28,2],[29,0,29,2],[35,0,35,2],[36,0,36,2],[37,0,37,2],[38,0,38,2],[39,0,39,2],[104,3,104,4],[46,1,46,2],[52,0,52,1],[59,1,59,2],[60,1,60,2],[61,1,61,2],[62,1,62,2],[63,1,63,2],[74,1,75,1],[81,1,82,1],[100,0,100,1],[103,3,103,4],[91,1,91,2],[92,1,92,2],[105,3,105,4],[106,3,106,4],[107,3,107,4],[108,3,108,4],[112,1,112,3],[112,4,113,5],[113,2,113,3],[114,2,114,3],[114,4,114,5],[115,2,115,3],[115,4,115,5],[116,2,116,3],[116,4,116,5],[140,0,140,3],[142,0,142,1],[150,0,150,3],[152,0,152,1],[200,0,214,0],[160,0,160,3],[162,0,162,1],[170,0,170,3],[172,0,172,1],[180,0,180,3],[182,0,182,1],[141,0,141,3],[151,0,151,3],[161,0,161,3],[171,0,171,3],[181,0,181,3],[117,2,117,3],[117,4,117,5],[118,2,118,3],[118,4,118,5],[119,2,119,3],[119,4,119,5],[493,0,493,3],[495,4,496,4],[281,0,295,0],[314,0,314,3],[316,0,316,1],[320,0,334,0],[299,0,307,0],[337,0,347,0],[377,0,389,0],[413,1,414,1],[354,0,354,3],[356,0,356,1],[360,0,374,0],[396,0,396,3],[398,0,398,1],[419,1,420,1],[218,0,232,0],[465,0,465,5],[480,0,480,5],[492,0,492,5],[239,0,239,3],[241,0,241,1],[245,0,259,0],[262,0,268,0],[275,0,275,3],[277,0,277,1],[425,1,426,1],[431,1,432,1],[437,1,438,1],[459,0,459,5],[397,0,397,3],[355,0,355,3],[315,0,315,3],[276,0,276,3]]}
["LRFR of Smooth Steel Pipe Structures                                     "]
[]
["A.   Design Dimensions"]
[]
["   1.  For typical structures, use the actual field measured span for calculations."]
["   2.  For those deflected over 5%, use 2 x the top radius (2 Rt) in lieu of span for calculations."]
[]
["Then, Span Length used in Load Rating Calculation =",null,null,{"$f":"'Design Load Rating'!D8","v":8},"ft"]
["Then, Rt used in Load Rating Calculation =",null,null,{"$f":"'Design Load Rating'!D9","v":4},"ft"]
[]
[null,"Inside radius of the steel pipe, ri =",null,{"$f":"'Design Load Rating'!D11","v":48},"in"]
[null,"Outside radius of the steel pipe, ro =",null,{"$f":"'Design Load Rating'!D12","v":49.064999999999998},"in"]
[null,"Mean radius of the steel pipe, r =",null,{"$f":"'Design Load Rating'!D13","v":48.532499999999999},"in"]
[]
["B.   Pipe Properties",null,null," "]
[]
["Mechanical Properties:"]
[null,"Fy = Minimum Yield Point of the Steel",null,{"$f":"'Design Load Rating'!D18","v":33},"ksi"]
[null,"Fu = Minimum Tensile Strength of the Steel",null,{"$f":"'Design Load Rating'!D19","v":45},"ksi"]
[null,"E = Modulus of Elasticity of Steel",null,{"$f":"'Design Load Rating'!D20","v":29000},"ksi"]
{"$rows_left_out":481}
{"sheet":"Summary","index":5,"n_rows":57,"n_cols":11,"rows_kept":57,"cut":false,"hidden":false,"merged":[[57,0,57,10],[58,0,58,10],[59,0,59,10],[60,0,60,10],[61,0,61,10],[54,1,54,3],[45,6,45,7],[45,12,45,13],[46,6,46,7],[46,12,46,13],[47,12,47,13],[51,1,51,3],[52,1,52,3],[52,4,52,5],[52,6,52,7],[53,1,53,3],[53,5,53,7],[40,0,40,1],[41,0,41,1],[43,6,43,8],[43,12,43,13],[20,0,22,0],[20,1,22,1],[20,2,20,5],[20,6,20,10],[21,2,22,2],[44,6,44,8],[44,12,44,13],[21,3,22,3],[21,4,22,4],[21,5,22,5],[21,6,22,6],[21,7,22,7],[21,8,22,8],[21,10,22,10],[18,0,18,2],[18,4,18,5],[18,8,18,10],[19,0,19,2],[19,8,19,10],[16,0,16,2],[16,4,16,5],[16,8,16,10],[17,0,17,2],[17,4,17,5],[17,8,17,10],[13,8,13,10],[14,0,14,2],[14,4,14,6],[14,8,14,10],[15,4,15,5],[15,8,15,10],[12,8,12,10],[7,1,7,2],[7,4,7,6],[7,8,7,10],[8,1,8,2],[8,4,8,6],[8,8,8,10],[9,1,9,2],[9,4,9,6],[9,8,9,10],[10,1,10,10],[11,8,11,10],[5,1,5,2],[5,4,5,6],[5,8,5,10],[6,1,6,2],[6,4,6,6],[6,8,6,10],[0,8,0,10],[1,0,1,10],[2,8,2,10],[3,8,3,10],[4,1,4,2],[4,4,4,6],[4,8,4,10]]}
[]
["  Bridge Load Rating Summary Sheet"]
["Bridge Data"]
[]
["District    ",{"$f":"Input!B3","v":2},null,"Structure Number",{"$f":"Input!E3","v":2264300100701},null,null,"Bridge Name ",{"$f":"Input!K3","v":"Drain Canal"}]
["Parish   ",{"$f":"Input!B4","v":26},null,"Recall Number",{"$f":"Input!E4","v":20459},null,null,"Inspection Date",{"$f":"Input!K4","v":"02/12/2018"}]
["Route",{"$f":"Input!B5","v":"LA 3139"},null,"Year Built",{"$f":"Input!E5","v":1986},null,null,"Overall",{"$f":"Input!K5","v":"7"}]
["Bridge Posting",{"$f":"Input!B6","v":"-"},null,"Design Load",{"$f":"Input!E6","v":"-"},null,null,"Deck",{"$f":"Input!K6","v":"N"}]
["Bridge Type",{"$f":"Input!B7","v":"STLPIP"},null,"Roadway Width",{"$f":"Input!E7","v":38},null,null,"Super",{"$f":"Input!K7","v":"N"}]
["Bridge Length",{"$f":"Input!B8","v":25},null,"Plan Location"," ",null,null,"Sub",{"$f":"Input!K8","v":"N"}]
["Standard Plan",{"$f":"Input!B9","v":" "}]
[]
["Bridge/Culvert Load Rating Summary"]
[]
["Dead Load",null,null,null,"LRFR Evaluation Factors",null,null,"Traffic"]
["Wearing Surface Thickness (in)",null,null," ","Condition Factor, super (φc)",null,{"$f":"Input!F14","v":"-"},"ADTT (one way)",200]
["Wearing Surface Type",null,null," ","Condition Factor, sub (φc)"]
["Non-Structural Attachments",null,null,{"$f":"Input!D16","v":"-"},"System Factor, super (φs)",null,{"$f":"Input!F15","v":1}]
["Fill Thickness (in)",null,null,{"$f":"Input!D14","v":63},"System Factor, sub (φs)"]
[]
{"$rows_left_out":38}
{"sheet":"Modulus of Soil Reaction","index":6,"n_rows":0,"n_cols":0,"rows_kept":0,"cut":false,"hidden":false,"merged":[]}

{"sheet":"Calcs","index":7,"n_rows":31,"n_cols":13,"rows_kept":31,"cut":false,"hidden":true,"merged":[[1,1,1,4],[18,0,24,0],[25,0,29,0]]}
[]
[null,"Posting Sign Table"]
[null,"Group A","Group B"," Sign #","Post Sign"]
[null,0,0,1,"Closed"]
[null,3,3,2,"3"]
[null,4,4,3,"4"]
[null,5,5,4,"5"]
[null,10,15,5,"10-15"]
[null,15,25,6,"15-25"]
[null,20,35,7,"20-35"]
[null,25,40,8,"25-40"]
[null,"<=25",">40",9,"25-NL"]
[null,"<=30",">40",10,"30-NL"]
[null,"<=35",">40",11,"35-NL"]
[null,">35",">40",12,"No Limit"]
[]
[]
[null,"Vehicle Type","GVW (kips)","Super RF","Sub RF","Min RF","Post Weight"," Post Sign ","Sign #",null,"WT IF RF<1",null,"Sub WT"]
["Group A","NRL",80,{"$f":"+Summary!C32","v":3.1853637865072568},{"$f":"+Summary!G32","v":0},{"$f":"IF(E19=0,D19,MIN(D19:E19))","v":3.1853637865072568},{"$f":"PostingWeight(F20,C20)","v":83.629239405451884},null,null,null,null,null,{"$f":"INT((IF(E19<0.3,0,IF(AND(E19>=0.3,E19<1),(C19/(2*0.7))*(E19-0.3),IF(E19>=1,(C19/2)*(E19),\"error\")))*100+0.5))/100","v":0}]
[null,"LA Type 3",41,{"$f":"Summary!C27","v":4.0794750929488721},{"$f":"Summary!G27","v":0},{"$f":"IF(E20=0,D20,MIN(D20:E20))","v":4.0794750929488721},{"$f":"PostingWeight(F20,C20)","v":83.629239405451884},{"$f":"postingsignA(G20,F20,MinRatingB)","v":"No Limit"},{"$f":"INDEX($D$4:$D$15,MATCH($H20,$E$4:$E$15,0))","v":12},null,{"$f":"IF(F20<1,PostingWeight(F20,C20), 40)","v":40},null,{"$f":"INT((IF(E20<0.3,0,IF(AND(E20>=0.3,E20<1),(C20/(2*0.7))*(E20-0.3),IF(E20>=1,(C20/2)*(E20),\"error\")))*100+0.5))/100","v":0}]
{"$rows_left_out":12}
{"sheet":"Options","index":8,"n_rows":13,"n_cols":1,"rows_kept":13,"cut":false,"hidden":true,"merged":[]}
["Pipe Shape"]
["Circular"]
[]
[]
[]
["Coating and Lining Type"]
["Flexible Lining and Coating"]
[]
[]
[]
["Water Load Options"]
["Yes"]
["No"]